BDBM39402 2-(3-chlorophenyl)-7-(2,5-dimethoxyphenyl)-5-methyl-1,7-dihydro-[1,2,4]triazolo[1,5-a]pyrimidine-6-carboxamide::2-(3-chlorophenyl)-7-(2,5-dimethoxyphenyl)-5-methyl-4,7-dihydro[1,2,4]triazolo[1,5-a]pyrimidine-6-carboxamide::MLS000085051::SMR000019597::cid_5771466
SMILES COc1ccc(OC)c(c1)C1C(C(N)=O)C(C)=Nc2nc(nn12)-c1cccc(Cl)c1
InChI Key InChIKey=QOPCMQCBYTVVCW-UHFFFAOYSA-N
Data  1 IC50
  Tab Delimited (TSV)   2D SDfile   Computed 3D by Vconf -m prep SDfile
Find this compound or compounds like it in BindingDB:
Activity Spreadsheet -- Enzyme Inhibition Constant Data from BindingDB
Found 1 hit for monomerid = 39402
TargetGenome polyprotein(West Nile virus)
University of Pittsburgh
Curated by PubChem BioAssay
LigandPNGBDBM39402(2-(3-chlorophenyl)-7-(2,5-dimethoxyphenyl)-5-methy...)
Affinity DataIC50: >5.00E+4nM. Assay description: The HTS assay to identify Inhibitors of West Nile Virus (WNV) NS2bNS3 Proteinase was proposed by Dr Alex Strongin of the Burnham Institute XO1-MH0776...
In DepthDetails PCBioAssay